BDBM50214227 CHEMBL251764::N-(5-((R)-3-((S)-3-(4-chlorophenyl)-1-(3,4-dimethoxyphenyl)propylamino)-2-hydroxypropyl)-2-hydroxyphenyl)methanesulfonamide
SMILES COc1ccc(cc1OC)[C@H](CCc1ccc(Cl)cc1)NC[C@H](O)Cc1ccc(O)c(NS(C)(=O)=O)c1
InChI Key InChIKey=QJXDPNWALDKJNB-PKTZIBPZSA-N
Data  3 KI
  Tab Delimited (TSV)   2D SDfile   Computed 3D by Vconf -m prep SDfile
Find this compound or compounds like it in BindingDB:
Activity Spreadsheet -- Enzyme Inhibition Constant Data from BindingDB
Found 1 hit for monomerid = 50214227
TargetBeta-2 adrenergic receptor(Homo sapiens (Human))
Bristol-Myers Squibb Pharmaceutical Research Institute
Curated by ChEMBL
LigandPNGBDBM50214227(CHEMBL251764 | N-(5-((R)-3-((S)-3-(4-chlorophenyl)...)
Affinity DataKi:  120nM. Assay description: Displacement of [125I]iodocyanopindolol from human cloned adrenergic beta-2 receptor expressed in CHO cells
In DepthDetails ArticlePubMed